JavaShuo
栏目
标签
Compilation 【failed】
时间 2020-07-24
标签
compilation
failed
繁體版
原文
原文链接
设置路径!html export PATH=$PATH:/home/XXX/toolchain4/pre/binlinux make sure the cross compiler tool chain can be found in the $PATH 这样才能够查找到arm-apple-darwin9-gcc等ios PjSIP Compilation Getting pjsip so
>>阅读原文<<
相关文章
1.
【Android】org.gradle.api.internal.tasks.compile.CompilationFailedException: Compilation failed
2.
Android resource compilation failed
3.
org.gradle.api.internal.tasks.compile.CompilationFailedException: Compilation failed;
4.
jsmooth compilation failed error null
5.
Error:java: Compilation failed: internal java compiler error
6.
Caused by: org.gradle.api.internal.tasks.compile.CompilationFailedException: Compilation failed; see
7.
Compilation failed: internal java compiler error
8.
Error:java: Compilation failed: internal java compiler
9.
Error:java: Compilation failed: internal java comp
10.
org.gradle.api.internal.tasks.compile.CompilationFailedException: Compilation failed; see the compil
更多相关文章...
•
C# 简介
-
C#教程
•
PHP mysqli_init() 函数
-
PHP参考手册
相关标签/搜索
compilation
failed
failed......executable
0
分享到微博
分享到微信
分享到QQ
每日一句
每一个你不满意的现在,都有一个你没有努力的曾经。
最新文章
1.
安装cuda+cuDNN
2.
GitHub的使用说明
3.
phpDocumentor使用教程【安装PHPDocumentor】
4.
yarn run build报错Component is not found in path “npm/taro-ui/dist/weapp/components/rate/index“
5.
精讲Haproxy搭建Web集群
6.
安全测试基础之MySQL
7.
C/C++编程笔记:C语言中的复杂声明分析,用实例带你完全读懂
8.
Python3教程(1)----搭建Python环境
9.
李宏毅机器学习课程笔记2:Classification、Logistic Regression、Brief Introduction of Deep Learning
10.
阿里云ECS配置速记
本站公众号
欢迎关注本站公众号,获取更多信息
相关文章
1.
【Android】org.gradle.api.internal.tasks.compile.CompilationFailedException: Compilation failed
2.
Android resource compilation failed
3.
org.gradle.api.internal.tasks.compile.CompilationFailedException: Compilation failed;
4.
jsmooth compilation failed error null
5.
Error:java: Compilation failed: internal java compiler error
6.
Caused by: org.gradle.api.internal.tasks.compile.CompilationFailedException: Compilation failed; see
7.
Compilation failed: internal java compiler error
8.
Error:java: Compilation failed: internal java compiler
9.
Error:java: Compilation failed: internal java comp
10.
org.gradle.api.internal.tasks.compile.CompilationFailedException: Compilation failed; see the compil
>>更多相关文章<<